AMBER Archive (2008)

Subject: AMBER: Amber compile

From: Shultz, Jack (JShultz_at_nas.edu)
Date: Tue Aug 19 2008 - 13:21:18 CDT


I solved my last error message by using the cygwin flag. Now I get this error. Does this have anything to do with word count? I have Wc installed.

WcActCB.c:1461: error: parse error before "XtAppContext"
WcActCB.c:1461: warning: data definition has no type or storage class
WcActCB.c:1536: error: redefinition of 'numApps'
WcActCB.c:1334: error: previous definition of 'numApps' was here
WcActCB.c:1536: error: parse error before "for"
WcActCB.c:1536: error: variable-size type declared outside of any function
WcActCB.c:1536: error: variable-sized object may not be initialized
WcActCB.c:1536: warning: data definition has no type or storage class
WcActCB.c:1536: error: parse error before '}' token
WcActCB.c:1538: error: parse error before '(' token
WcCreateP.h:253: warning: array 'wcWidgetCvtArgs' assumed to have one element
make[2]: *** [WcActCB.o] Error 1
make[2]: Leaving directory `/usr/local/amber9/src/leap/src/Wc'
make[1]: *** [install] Error 2
make[1]: Leaving directory `/usr/local/amber9/src/leap'
make: *** [serial] Error 2

-----------------------------------------------------------------------
The AMBER Mail Reflector
To post, send mail to amber_at_scripps.edu
To unsubscribe, send "unsubscribe amber" (in the *body* of the email)
      to majordomo_at_scripps.edu