AMBER Archive (2006)

Subject: AMBER: compile error with pgf90

From: Evan Kelly (
Date: Fri Jun 02 2006 - 00:33:21 CDT

Hi Everyone,

I am attempting to compile AMBER 9 in serial using the portland group
pgf90 compiler on an HP Opteron cluster. I get the following error
on executing make serial:

cpp -traditional -P -DHAS_LAPACK -I../src/include ../src/tools/
mkdos.F90 > ../obj/mkdos.f
pgf90 -c -tp p7 -Mscalarsse -Mvect=sse -Mflushz -fast -O3 -Mfree -
module ../../sander -o ../obj/mkd
os.o ../obj/mkdos.f
PGF90-F-0000-Internal compiler error. search_ivuse: iv not found
154 (../obj/mkdos.f: 27)
make[3]: *** [../obj/mkdos.o] Error 2
make[3]: Leaving directory `/home/users/ebkelly/bin/amber9/src/dcqtp/
make[2]: *** [libdivcon.a] Error 2
make[2]: Leaving directory `/home/users/ebkelly/bin/amber9/src/dcqtp'
make[1]: *** [divcon] Error 2
make[1]: Leaving directory `/home/users/ebkelly/bin/amber9/src/sander'
make: *** [serial] Error 2

Any suggestions on what the problem may be and possible fixes or
workarounds would be greatly appreciated.


Evan Kelly

The AMBER Mail Reflector
To post, send mail to
To unsubscribe, send "unsubscribe amber" to