AMBER Archive (2009)

Subject: [AMBER] Installation issue

From: Ashveen Seenauth (
Date: Tue Sep 22 2009 - 11:17:49 CDT


I am having issues running Amber10 on cygnum. After installing cygnum
and following the procedures explained on, I cannot run the test properly for
some reason.
In fact after completing step 7, the last line does not say "Completed
installation of AmberTools ver. 1.1".
the last few lines are;

make[2]: *** [checkexpr.c] Error 1
make[2]: Leaving directory `/home/Ashveen Seenauth/amber10/src/semantics'
make[1]: *** [checkexpr.c] Error 2
make[1]: Leaving directory `/home/Ashveen Seenauth/amber10/src/nab'
make: *** [install] Error 2

I shall be very grateful if someone can help me fixing this please.

Thank you,

AMBER mailing list